Reaction Details
TargetReceptor-type tyrosine-protein kinase FLT3
LigandBDBM50093352
Substrate/Competitorn/a
Meas. Tech.ChEMBL_1500402 (CHEMBL3587035)
Ki>4000±n/a nM
Citation Collier, PNMessersmith, DLe Tiran, ABandarage, UKBoucher, CCome, JCottrell, KMDamagnez, VDoran, JDGriffith, JPKhare-Pandit, SKrueger, EBLedeboer, MWLedford, BLiao, YMahajan, SMoody, CSRoday, SWang, TXu, JAronov, AM Discovery of Highly Isoform Selective Thiazolopiperidine Inhibitors of Phosphoinositide 3-Kinase¿. J Med Chem58:5684-8 (2015) 
 
Receptor-type tyrosine-protein kinase FLT3
Name:Receptor-type tyrosine-protein kinase FLT3
Type:Enzyme
Mol. Mass.:112888.62
Organism:Homo sapiens (Human)
Description:P36888
Residue:993
BDBM50093352
NameBDBM50093352
Synonyms:CHEMBL3586678
TypeSmall organic molecule
Emp. Form.C19H22F2N8O2S
Mol. Mass.464.492
SMILESCOc1cncc(n1)N1CCc2nc(NC(=O)NCCc3cn(CC(F)F)cn3)sc2C1