Reaction Details
TargetPhosphatidylinositol 4,5-bisphosphate 3-kinase catalytic subunit gamma isoform
LigandBDBM50093356
Substrate/Competitorn/a
Meas. Tech.ChEMBL_1500395 (CHEMBL3587028)
Ki 0.006000±n/a nM
Citation Collier, PNMessersmith, DLe Tiran, ABandarage, UKBoucher, CCome, JCottrell, KMDamagnez, VDoran, JDGriffith, JPKhare-Pandit, SKrueger, EBLedeboer, MWLedford, BLiao, YMahajan, SMoody, CSRoday, SWang, TXu, JAronov, AM Discovery of Highly Isoform Selective Thiazolopiperidine Inhibitors of Phosphoinositide 3-Kinase¿. J Med Chem58:5684-8 (2015) 
 
Phosphatidylinositol 4,5-bisphosphate 3-kinase catalytic subunit gamma isoform
Name:Phosphatidylinositol 4,5-bisphosphate 3-kinase catalytic subunit gamma isoform
Type:Enzyme Subunit
Mol. Mass.:126470.30
Organism:Homo sapiens (Human)
Description:P48736
Residue:1102
BDBM50093356
NameBDBM50093356
Synonyms:CHEMBL3586676
TypeSmall organic molecule
Emp. Form.C20H24FN7O2S
Mol. Mass.445.514
SMILESCOc1cncc(c1)N1CCc2nc(NC(=O)NCCc3cn(CCF)cn3)sc2C1