Reaction Details
TargetATPase family AAA domain-containing protein 2
LigandBDBM50096298
Substrate/Competitorn/a
Meas. Tech.ChEMBL_1500426 (CHEMBL3587157)
IC50 1585±n/a nM
Citation Demont, EHChung, CWFurze, RCGrandi, PMichon, AMWellaway, CBarrett, NBridges, AMCraggs, PDDiallo, HDixon, DPDouault, CEmmons, AJJones, EJKaramshi, BVLocke, KMitchell, DJMouzon, BHPrinjha, RKRoberts, ADSheppard, RJWatson, RJBamborough, P Fragment-Based Discovery of Low-Micromolar ATAD2 Bromodomain Inhibitors. J Med Chem58:5649-73 (2015) 
 
ATPase family AAA domain-containing protein 2
Name:ATPase family AAA domain-containing protein 2
Type:PROTEIN
Mol. Mass.:158546.30
Organism:Homo sapiens (Human)
Description:ChEMBL_1500426
Residue:1390
BDBM50096298
NameBDBM50096298
Synonyms:CHEMBL3585458
TypeSmall organic molecule
Emp. Form.C21H25N5O
Mol. Mass.363.4561
SMILESCc1cncc(c1C)-c1cnc(NC2CCNCC2)c2[nH]c(=O)c(C)cc12