Reaction Details
TargetATPase family AAA domain-containing protein 2
LigandBDBM50093469
Substrate/Competitorn/a
Meas. Tech.ChEMBL_1500426 (CHEMBL3587157)
IC50 501187±n/a nM
Citation Demont, EHChung, CWFurze, RCGrandi, PMichon, AMWellaway, CBarrett, NBridges, AMCraggs, PDDiallo, HDixon, DPDouault, CEmmons, AJJones, EJKaramshi, BVLocke, KMitchell, DJMouzon, BHPrinjha, RKRoberts, ADSheppard, RJWatson, RJBamborough, P Fragment-Based Discovery of Low-Micromolar ATAD2 Bromodomain Inhibitors. J Med Chem58:5649-73 (2015) 
 
ATPase family AAA domain-containing protein 2
Name:ATPase family AAA domain-containing protein 2
Type:PROTEIN
Mol. Mass.:158546.30
Organism:Homo sapiens (Human)
Description:ChEMBL_1500426
Residue:1390
BDBM50093469
NameBDBM50093469
Synonyms:CHEMBL3586696
TypeSmall organic molecule
Emp. Form.C13H18N4O
Mol. Mass.246.3082
SMILESCN(C)CCNc1nccc2cc(C)c(=O)[nH]c12