Reaction Details
TargetATPase family AAA domain-containing protein 2
LigandBDBM50096319
Substrate/Competitorn/a
Meas. Tech.ChEMBL_1500426 (CHEMBL3587157)
IC50 25119±n/a nM
Citation Demont, EHChung, CWFurze, RCGrandi, PMichon, AMWellaway, CBarrett, NBridges, AMCraggs, PDDiallo, HDixon, DPDouault, CEmmons, AJJones, EJKaramshi, BVLocke, KMitchell, DJMouzon, BHPrinjha, RKRoberts, ADSheppard, RJWatson, RJBamborough, P Fragment-Based Discovery of Low-Micromolar ATAD2 Bromodomain Inhibitors. J Med Chem58:5649-73 (2015) 
 
ATPase family AAA domain-containing protein 2
Name:ATPase family AAA domain-containing protein 2
Type:PROTEIN
Mol. Mass.:158546.30
Organism:Homo sapiens (Human)
Description:ChEMBL_1500426
Residue:1390
BDBM50096319
NameBDBM50096319
Synonyms:CHEMBL3586718
TypeSmall organic molecule
Emp. Form.C17H22N4O
Mol. Mass.298.3828
SMILES[H][C@]12CC[C@]([H])(C[C@H](C1)Nc1nccc3cc(C)c(=O)[nH]c13)N2C