Reaction Details
TargetAngiotensin-converting enzyme
LigandBDBM50368166
Substrate/Competitorn/a
Meas. Tech.ChEMBL_1501476 (CHEMBL3586838)
IC50 110±n/a nM
Citation Jallapally, AAddla, DBagul, PSridhar, BBanerjee, SKKantevari, S Design, synthesis and evaluation of novel 2-butyl-4-chloroimidazole derived peptidomimetics as Angiotensin Converting Enzyme (ACE) inhibitors. Bioorg Med Chem23:3526-33 (2015) 
 
Angiotensin-converting enzyme
Name:Angiotensin-converting enzyme
Type:n/a
Mol. Mass.:150405.15
Organism:Oryctolagus cuniculus
Description:n/a
Residue:1310
BDBM50368166
NameBDBM50368166
Synonyms:Accupril | QUINAPRIL
TypeSmall organic molecule
Emp. Form.C25H30N2O5
Mol. Mass.438.5161
SMILESCCOC(=O)[C@H](CCc1ccccc1)N[C@@H](C)C(=O)N1Cc2ccccc2C[C@H]1C(O)=O