Reaction Details
TargetOrexin receptor type 2
LigandBDBM50093795
Substrate/Competitorn/a
Meas. Tech.ChEMBL_1502023 (CHEMBL3588582)
Ki 6.0±n/a nM
Citation Yoshida, YNaoe, YTerauchi, TOzaki, FDoko, TTakemura, ATanaka, TSorimachi, KBeuckmann, CTSuzuki, MUeno, TOzaki, SYonaga, M Discovery of (1R,2S)-2-{[(2,4-Dimethylpyrimidin-5-yl)oxy]methyl}-2-(3-fluorophenyl)-N-(5-fluoropyridin-2-yl)cyclopropanecarboxamide (E2006): A Potent and Efficacious Oral Orexin Receptor Antagonist. J Med Chem58:4648-64 (2015) 
 
Orexin receptor type 2
Name:Orexin receptor type 2
Type:Protein
Mol. Mass.:50710.53
Organism:Homo sapiens (Human)
Description:O43614
Residue:444
BDBM50093795
NameBDBM50093795
Synonyms:CHEMBL3585952
TypeSmall organic molecule
Emp. Form.C23H23FN4O3
Mol. Mass.422.4521
SMILESCOc1cc(NC(=O)[C@@H]2C[C@@]2(COc2cnc(C)nc2C)c2ccccc2)ncc1F