Reaction Details
TargetMitogen-activated protein kinase 1
LigandBDBM50094308
Substrate/Competitorn/a
Meas. Tech.ChEMBL_1503903 (CHEMBL3593136)
IC50 8700±n/a nM
Citation Ward, RAColclough, NChallinor, MDebreczeni, JEEckersley, KFairley, GFeron, LFlemington, VGraham, MAGreenwood, RHopcroft, PHoward, TDJames, MJones, CDJones, CRRenshaw, JRoberts, KSnow, LTonge, MYeung, K Structure-Guided Design of Highly Selective and Potent Covalent Inhibitors of ERK1/2. J Med Chem58:4790-801 (2015) 
 
Mitogen-activated protein kinase 1
Name:Mitogen-activated protein kinase 1
Type:Ser/Thr Protein Kinase
Mol. Mass.:41392.76
Organism:Homo sapiens (Human)
Description:P28482
Residue:360
BDBM50094308
NameBDBM50094308
Synonyms:CHEMBL3590114
TypeSmall organic molecule
Emp. Form.C19H18F4N6O
Mol. Mass.422.3794
SMILESCNC(=O)c1ccc(F)cc1Nc1cc(Nc2cc(C)nn2C)ncc1C(F)(F)F