Reaction Details
TargetMitogen-activated protein kinase 1
LigandBDBM50094311
Substrate/Competitorn/a
Meas. Tech.ChEMBL_1503903 (CHEMBL3593136)
IC50 380±n/a nM
Citation Ward, RAColclough, NChallinor, MDebreczeni, JEEckersley, KFairley, GFeron, LFlemington, VGraham, MAGreenwood, RHopcroft, PHoward, TDJames, MJones, CDJones, CRRenshaw, JRoberts, KSnow, LTonge, MYeung, K Structure-Guided Design of Highly Selective and Potent Covalent Inhibitors of ERK1/2. J Med Chem58:4790-801 (2015) 
 
Mitogen-activated protein kinase 1
Name:Mitogen-activated protein kinase 1
Type:Ser/Thr Protein Kinase
Mol. Mass.:41392.76
Organism:Homo sapiens (Human)
Description:P28482
Residue:360
BDBM50094311
NameBDBM50094311
Synonyms:CHEMBL3590111
TypeSmall organic molecule
Emp. Form.C14H16N4O2S
Mol. Mass.304.367
SMILESCc1cc(ccn1)-c1n[nH]c2CCN(Cc12)S(=O)(=O)C=C