Reaction Details
TargetMitogen-activated protein kinase 1
LigandBDBM50094312
Substrate/Competitorn/a
Meas. Tech.ChEMBL_1503903 (CHEMBL3593136)
IC50 120±n/a nM
Citation Ward, RAColclough, NChallinor, MDebreczeni, JEEckersley, KFairley, GFeron, LFlemington, VGraham, MAGreenwood, RHopcroft, PHoward, TDJames, MJones, CDJones, CRRenshaw, JRoberts, KSnow, LTonge, MYeung, K Structure-Guided Design of Highly Selective and Potent Covalent Inhibitors of ERK1/2. J Med Chem58:4790-801 (2015) 
 
Mitogen-activated protein kinase 1
Name:Mitogen-activated protein kinase 1
Type:Ser/Thr Protein Kinase
Mol. Mass.:41392.76
Organism:Homo sapiens (Human)
Description:P28482
Residue:360
BDBM50094312
NameBDBM50094312
Synonyms:CHEMBL3590110
TypeSmall organic molecule
Emp. Form.C14H12N4O2S
Mol. Mass.300.336
SMILESC=CS(=O)(=O)Nc1ccc2[nH]nc(-c3ccncc3)c2c1