Reaction Details
TargetMitogen-activated protein kinase 1
LigandBDBM50094470
Substrate/Competitorn/a
Meas. Tech.ChEMBL_1503902 (CHEMBL3593135)
IC50 8.5±n/a nM
Citation Ward, RAColclough, NChallinor, MDebreczeni, JEEckersley, KFairley, GFeron, LFlemington, VGraham, MAGreenwood, RHopcroft, PHoward, TDJames, MJones, CDJones, CRRenshaw, JRoberts, KSnow, LTonge, MYeung, K Structure-Guided Design of Highly Selective and Potent Covalent Inhibitors of ERK1/2. J Med Chem58:4790-801 (2015) 
 
Mitogen-activated protein kinase 1
Name:Mitogen-activated protein kinase 1
Type:Ser/Thr Protein Kinase
Mol. Mass.:41392.76
Organism:Homo sapiens (Human)
Description:P28482
Residue:360
BDBM50094470
NameBDBM50094470
Synonyms:CHEMBL3590121
TypeSmall organic molecule
Emp. Form.C19H20F3N5O2
Mol. Mass.407.3896
SMILESFC(F)(F)c1cnc(NC2CCOCC2)nc1Nc1ccccc1NC(=O)C=C