Reaction Details
TargetMitogen-activated protein kinase 1
LigandBDBM50094309
Substrate/Competitorn/a
Meas. Tech.ChEMBL_1503902 (CHEMBL3593135)
IC50 1800±n/a nM
Citation Ward, RAColclough, NChallinor, MDebreczeni, JEEckersley, KFairley, GFeron, LFlemington, VGraham, MAGreenwood, RHopcroft, PHoward, TDJames, MJones, CDJones, CRRenshaw, JRoberts, KSnow, LTonge, MYeung, K Structure-Guided Design of Highly Selective and Potent Covalent Inhibitors of ERK1/2. J Med Chem58:4790-801 (2015) 
 
Mitogen-activated protein kinase 1
Name:Mitogen-activated protein kinase 1
Type:Ser/Thr Protein Kinase
Mol. Mass.:41392.76
Organism:Homo sapiens (Human)
Description:P28482
Residue:360
BDBM50094309
NameBDBM50094309
Synonyms:CHEMBL3590113
TypeSmall organic molecule
Emp. Form.C14H14N4O2S
Mol. Mass.302.352
SMILESCCS(=O)(=O)Nc1ccc2[nH]nc(-c3ccncc3)c2c1