Reaction Details
TargetMitogen-activated protein kinase 1
LigandBDBM50094466
Substrate/Competitorn/a
Meas. Tech.ChEMBL_1503901 (CHEMBL3593134)
IC50 39±n/a nM
Citation Ward, RAColclough, NChallinor, MDebreczeni, JEEckersley, KFairley, GFeron, LFlemington, VGraham, MAGreenwood, RHopcroft, PHoward, TDJames, MJones, CDJones, CRRenshaw, JRoberts, KSnow, LTonge, MYeung, K Structure-Guided Design of Highly Selective and Potent Covalent Inhibitors of ERK1/2. J Med Chem58:4790-801 (2015) 
 
Mitogen-activated protein kinase 1
Name:Mitogen-activated protein kinase 1
Type:Ser/Thr Protein Kinase
Mol. Mass.:41392.76
Organism:Homo sapiens (Human)
Description:P28482
Residue:360
BDBM50094466
NameBDBM50094466
Synonyms:CHEMBL3590125
TypeSmall organic molecule
Emp. Form.C18H19N7O
Mol. Mass.349.3898
SMILESCc1cnc(Nc2ccnn2C)nc1Nc1ccccc1NC(=O)C=C