Reaction Details
TargetDual specificity mitogen-activated protein kinase kinase 1
LigandBDBM50094306
Substrate/Competitorn/a
Meas. Tech.ChEMBL_1503906 (CHEMBL3593139)
IC50>10000±n/a nM
Citation Ward, RAColclough, NChallinor, MDebreczeni, JEEckersley, KFairley, GFeron, LFlemington, VGraham, MAGreenwood, RHopcroft, PHoward, TDJames, MJones, CDJones, CRRenshaw, JRoberts, KSnow, LTonge, MYeung, K Structure-Guided Design of Highly Selective and Potent Covalent Inhibitors of ERK1/2. J Med Chem58:4790-801 (2015) 
 
Dual specificity mitogen-activated protein kinase kinase 1
Name:Dual specificity mitogen-activated protein kinase kinase 1
Type:Other Protein Type
Mol. Mass.:43439.03
Organism:Homo sapiens (Human)
Description:Full-length human MEK-1 was generated by PCR and purified as a fusion protein from Escherichia coli lysates.
Residue:393
BDBM50094306
NameBDBM50094306
Synonyms:CHEMBL3590116
TypeSmall organic molecule
Emp. Form.C19H20F4N4O2
Mol. Mass.412.3813
SMILESCNC(=O)c1ccc(F)cc1Nc1cc(NC2CCOCC2)ncc1C(F)(F)F