Reaction Details
TargetDual specificity mitogen-activated protein kinase kinase 1
LigandBDBM50094304
Substrate/Competitorn/a
Meas. Tech.ChEMBL_1503906 (CHEMBL3593139)
IC50>10000±n/a nM
Citation Ward, RAColclough, NChallinor, MDebreczeni, JEEckersley, KFairley, GFeron, LFlemington, VGraham, MAGreenwood, RHopcroft, PHoward, TDJames, MJones, CDJones, CRRenshaw, JRoberts, KSnow, LTonge, MYeung, K Structure-Guided Design of Highly Selective and Potent Covalent Inhibitors of ERK1/2. J Med Chem58:4790-801 (2015) 
 
Dual specificity mitogen-activated protein kinase kinase 1
Name:Dual specificity mitogen-activated protein kinase kinase 1
Type:Other Protein Type
Mol. Mass.:43439.03
Organism:Homo sapiens (Human)
Description:Full-length human MEK-1 was generated by PCR and purified as a fusion protein from Escherichia coli lysates.
Residue:393
BDBM50094304
NameBDBM50094304
Synonyms:CHEMBL3590118 | US9796700, Compound I-108
TypeSmall organic molecule
Emp. Form.C18H20ClN5O2
Mol. Mass.373.837
SMILESClc1cnc(NC2CCOCC2)nc1Nc1ccccc1NC(=O)C=C