Reaction Details
TargetBeta-secretase 1
LigandBDBM50210579
Substrate/Competitorn/a
Meas. Tech.ChEMBL_1503109 (CHEMBL3592359)
Ki 0.310000±n/a nM
Citation Vila-Real, HCoelho, HRocha, JFernandes, AVentura, MRMaycock, CDIranzo, OSimplício, AL Peptidomimeticß-Secretase Inhibitors Comprising a Sequence of Amyloid-ß Peptide for Alzheimer's Disease. J Med Chem58:5408-18 (2015) 
 
Beta-secretase 1
Name:Beta-secretase 1
Type:Protein
Mol. Mass.:55755.10
Organism:Homo sapiens (Human)
Description:P56817
Residue:501
BDBM50210579
NameBDBM50210579
Synonyms:(2S,5S,8S,11R,13S,14S,17S,20S,23S)-23-amino-2-benzyl-5-(2-carboxyethyl)-17-(carboxymethyl)-13-hydroxy-14,20-diisobutyl-8-isopropyl-11-methyl-4,7,10,16,19,22-hexaoxo-3,6,9,15,18,21-hexaazahexacosane-1,26-dioic acid OM00-3
TypeSmall organic molecule
Emp. Form.C44H69N7O15
Mol. Mass.936.0566
SMILESCC(C)C[C@H](NC(=O)[C@H](CC(O)=O)NC(=O)[C@H](CC(C)C)NC(=O)[C@@H](N)CCC(O)=O)[C@@H](O)C[C@@H](C)C(=O)N[C@@H](C(C)C)C(=O)N[C@@H](CCC(O)=O)C(=O)N[C@@H](Cc1ccccc1)C(O)=O