Reaction Details
TargetCannabinoid receptor 1
LigandBDBM50095901
Substrate/Competitorn/a
Meas. Tech.ChEMBL_1502233 (CHEMBL3591169)
IC50>10000±n/a nM
Citation Han, SZhang, FFQian, HYChen, LLPu, JBXie, XChen, JZ Development of Quinoline-2,4(1H,3H)-diones as Potent and Selective Ligands of the Cannabinoid Type 2 Receptor. J Med Chem58:5751-69 (2015) 
 
Cannabinoid receptor 1
Name:Cannabinoid receptor 1
Type:G Protein-Coupled Receptor (GPCR)
Mol. Mass.:52868.96
Organism:Homo sapiens (Human)
Description:P21554
Residue:472
BDBM50095901
NameBDBM50095901
Synonyms:CHEMBL3590297
TypeSmall organic molecule
Emp. Form.C25H31ClN2O2
Mol. Mass.426.979
SMILESCCCCCN1C(=O)\C(=C\NC23CC4CC(CC(C4)C2)C3)C(=O)c2cc(Cl)ccc12