Reaction Details
TargetCannabinoid receptor 1
LigandBDBM50095903
Substrate/Competitorn/a
Meas. Tech.ChEMBL_1502233 (CHEMBL3591169)
IC50>10000±n/a nM
Citation Han, SZhang, FFQian, HYChen, LLPu, JBXie, XChen, JZ Development of Quinoline-2,4(1H,3H)-diones as Potent and Selective Ligands of the Cannabinoid Type 2 Receptor. J Med Chem58:5751-69 (2015) 
 
Cannabinoid receptor 1
Name:Cannabinoid receptor 1
Type:G Protein-Coupled Receptor (GPCR)
Mol. Mass.:52868.96
Organism:Homo sapiens (Human)
Description:P21554
Residue:472
BDBM50095903
NameBDBM50095903
Synonyms:CHEMBL2096743
TypeSmall organic molecule
Emp. Form.C23H27N3O4
Mol. Mass.409.4782
SMILESCCCCOc1c(OC)ccc2cc(C(=O)NCCc3ccc(N)cc3)c(=O)[nH]c12