Reaction Details
TargetCannabinoid receptor 2
LigandBDBM50095873
Substrate/Competitorn/a
Meas. Tech.ChEMBL_1502230 (CHEMBL3591166)
EC50 83±n/a nM
Citation Han, SZhang, FFQian, HYChen, LLPu, JBXie, XChen, JZ Development of Quinoline-2,4(1H,3H)-diones as Potent and Selective Ligands of the Cannabinoid Type 2 Receptor. J Med Chem58:5751-69 (2015) 
 
Cannabinoid receptor 2
Name:Cannabinoid receptor 2
Type:G Protein-Coupled Receptor (GPCR)
Mol. Mass.:39690.94
Organism:Homo sapiens (Human)
Description:P34972
Residue:360
BDBM50095873
NameBDBM50095873
Synonyms:CHEMBL3590634
TypeSmall organic molecule
Emp. Form.C20H28N2O2
Mol. Mass.328.4485
SMILESCCCCN1C(=O)\C(=C\NC(C)C(C)C)C(=O)c2cccc(C)c12