Reaction Details
TargetCannabinoid receptor 2
LigandBDBM50095843
Substrate/Competitorn/a
Meas. Tech.ChEMBL_1502230 (CHEMBL3591166)
EC50>10000±n/a nM
Citation Han, SZhang, FFQian, HYChen, LLPu, JBXie, XChen, JZ Development of Quinoline-2,4(1H,3H)-diones as Potent and Selective Ligands of the Cannabinoid Type 2 Receptor. J Med Chem58:5751-69 (2015) 
 
Cannabinoid receptor 2
Name:Cannabinoid receptor 2
Type:G Protein-Coupled Receptor (GPCR)
Mol. Mass.:39690.94
Organism:Homo sapiens (Human)
Description:P34972
Residue:360
BDBM50095843
NameBDBM50095843
Synonyms:CHEMBL3590604
TypeSmall organic molecule
Emp. Form.C22H30N2O3
Mol. Mass.370.4852
SMILESCCCCCN1C(=O)\C(=C\NC2CCCCC2)C(=O)c2c(OC)cccc12