Reaction Details
TargetSerine/threonine-protein kinase PAK 1
LigandBDBM50096239
Substrate/Competitorn/a
Meas. Tech.ChEMBL_1505869 (CHEMBL3595326)
Ki 18±n/a nM
Citation Rudolph, JAliagas, ICrawford, JJMathieu, SLee, WChao, QDong, PRouge, LWang, WHeise, CMurray, LJLa, HLiu, YManning, GDiederich, FHoeflich, KP Leveraging the Pre-DFG Residue Thr-406 To Obtain High Kinase Selectivity in an Aminopyrazole-Type PAK1 Inhibitor Series. ACS Med Chem Lett6:711-5 (2015) 
 
Serine/threonine-protein kinase PAK 1
Name:Serine/threonine-protein kinase PAK 1
Type:n/a
Mol. Mass.:60640.15
Organism:Homo sapiens (Human)
Description:Q13153
Residue:545
BDBM50096239
NameBDBM50096239
Synonyms:CHEMBL3594180
TypeSmall organic molecule
Emp. Form.C21H32N8O
Mol. Mass.412.5318
SMILESCCN1CC[C@@H](C1=O)c1cc(Nc2ccnc(n2)N(C)C[C@H]2CC[C@H](N)CC2)n[nH]1