Reaction Details
TargetSerine/threonine-protein kinase PAK 4
LigandBDBM50096233
Substrate/Competitorn/a
Meas. Tech.ChEMBL_1505870 (CHEMBL3595327)
Ki 629±n/a nM
Citation Rudolph, JAliagas, ICrawford, JJMathieu, SLee, WChao, QDong, PRouge, LWang, WHeise, CMurray, LJLa, HLiu, YManning, GDiederich, FHoeflich, KP Leveraging the Pre-DFG Residue Thr-406 To Obtain High Kinase Selectivity in an Aminopyrazole-Type PAK1 Inhibitor Series. ACS Med Chem Lett6:711-5 (2015) 
 
Serine/threonine-protein kinase PAK 4
Name:Serine/threonine-protein kinase PAK 4
Type:Protein
Mol. Mass.:64098.01
Organism:Homo sapiens (Human)
Description:O96013
Residue:591
BDBM50096233
NameBDBM50096233
Synonyms:CHEMBL3593824
TypeSmall organic molecule
Emp. Form.C21H21ClN8O
Mol. Mass.436.897
SMILESCN(Cc1ccc2[nH]cnc2c1Cl)c1nccc(Nc2cc([nH]n2)C2CCC(=O)C2)n1