Reaction Details
TargetAurora kinase A
LigandBDBM50096235
Substrate/Competitorn/a
Meas. Tech.ChEMBL_1505871 (CHEMBL3595328)
Ki 893±n/a nM
Citation Rudolph, JAliagas, ICrawford, JJMathieu, SLee, WChao, QDong, PRouge, LWang, WHeise, CMurray, LJLa, HLiu, YManning, GDiederich, FHoeflich, KP Leveraging the Pre-DFG Residue Thr-406 To Obtain High Kinase Selectivity in an Aminopyrazole-Type PAK1 Inhibitor Series. ACS Med Chem Lett6:711-5 (2015) 
 
Aurora kinase A
Name:Aurora kinase A
Type:Serine/threonine-protein kinase
Mol. Mass.:45830.98
Organism:Homo sapiens (Human)
Description:O14965
Residue:403
BDBM50096235
NameBDBM50096235
Synonyms:CHEMBL3594173
TypeSmall organic molecule
Emp. Form.C20H22ClN9O
Mol. Mass.439.901
SMILESCN(Cc1cc(Nc2ccnc(n2)N(C)Cc2ccc3[nH]cnc3c2Cl)n[nH]1)C(C)=O