Reaction Details
TargetAurora kinase A
LigandBDBM50096229
Substrate/Competitorn/a
Meas. Tech.ChEMBL_1505871 (CHEMBL3595328)
Ki 3500±n/a nM
Citation Rudolph, JAliagas, ICrawford, JJMathieu, SLee, WChao, QDong, PRouge, LWang, WHeise, CMurray, LJLa, HLiu, YManning, GDiederich, FHoeflich, KP Leveraging the Pre-DFG Residue Thr-406 To Obtain High Kinase Selectivity in an Aminopyrazole-Type PAK1 Inhibitor Series. ACS Med Chem Lett6:711-5 (2015) 
 
Aurora kinase A
Name:Aurora kinase A
Type:Serine/threonine-protein kinase
Mol. Mass.:45830.98
Organism:Homo sapiens (Human)
Description:O14965
Residue:403
BDBM50096229
NameBDBM50096229
Synonyms:CHEMBL3594177
TypeSmall organic molecule
Emp. Form.C20H30N8O
Mol. Mass.398.5052
SMILESCN(C[C@H]1CC[C@H](N)CC1)c1nccc(Nc2cc([nH]n2)[C@H]2CCN(C)C2=O)n1