Reaction Details
TargetSerine/threonine-protein kinase B-raf
LigandBDBM50096324
Substrate/Competitorn/a
Meas. Tech.ChEMBL_1495598 (CHEMBL3578336)
IC50 28±n/a nM
Citation Henry, JRKaufman, MDPeng, SBAhn, YMCaldwell, TMVogeti, LTelikepalli, HLu, WPHood, MMRutkoski, TJSmith, BDVogeti, SMiller, DWise, SCChun, LZhang, XZhang, YKays, LHipskind, PAWrobleski, ADLobb, KLClay, JMCohen, JDWalgren, JLMcCann, DPatel, PClawson, DKGuo, SManglicmot, DGroshong, CLogan, CStarling, JJFlynn, DL Discovery of 1-(3,3-dimethylbutyl)-3-(2-fluoro-4-methyl-5-(7-methyl-2-(methylamino)pyrido[2,3-d]pyrimidin-6-yl)phenyl)urea (LY3009120) as a pan-RAF inhibitor with minimal paradoxical activation and activity against BRAF or RAS mutant tumor cells. J Med Chem58:4165-79 (2015) 
 
Serine/threonine-protein kinase B-raf
Name:Serine/threonine-protein kinase B-raf
Type:Serine/threonine-protein kinase
Mol. Mass.:84446.00
Organism:Homo sapiens (Human)
Description:P15056
Residue:766
BDBM50096324
NameBDBM50096324
Synonyms:CHEMBL3577121
TypeSmall organic molecule
Emp. Form.C24H30FN5O
Mol. Mass.423.5263
SMILESCNc1cc2nc(C)c(cc2cn1)-c1cc(NC(=O)NCCC(C)(C)C)c(F)cc1C