Reaction Details
TargetVascular endothelial growth factor receptor 2
LigandBDBM50096331
Substrate/Competitorn/a
Meas. Tech.ChEMBL_1495602 (CHEMBL3578340)
IC50 25±n/a nM
Citation Henry, JRKaufman, MDPeng, SBAhn, YMCaldwell, TMVogeti, LTelikepalli, HLu, WPHood, MMRutkoski, TJSmith, BDVogeti, SMiller, DWise, SCChun, LZhang, XZhang, YKays, LHipskind, PAWrobleski, ADLobb, KLClay, JMCohen, JDWalgren, JLMcCann, DPatel, PClawson, DKGuo, SManglicmot, DGroshong, CLogan, CStarling, JJFlynn, DL Discovery of 1-(3,3-dimethylbutyl)-3-(2-fluoro-4-methyl-5-(7-methyl-2-(methylamino)pyrido[2,3-d]pyrimidin-6-yl)phenyl)urea (LY3009120) as a pan-RAF inhibitor with minimal paradoxical activation and activity against BRAF or RAS mutant tumor cells. J Med Chem58:4165-79 (2015) 
 
Vascular endothelial growth factor receptor 2
Name:Vascular endothelial growth factor receptor 2
Type:Receptor Tyrosine Kinase
Mol. Mass.:151510.97
Organism:Homo sapiens (Human)
Description:P35968
Residue:1356
BDBM50096331
NameBDBM50096331
Synonyms:CHEMBL3577116
TypeSmall organic molecule
Emp. Form.C25H32FN5O2
Mol. Mass.453.5523
SMILESCCn1c2cc(NC)ncc2cc(-c2cc(NC(=O)NCCC(C)(C)C)c(F)cc2C)c1=O