Reaction Details
TargetTrace amine-associated receptor 1
LigandBDBM10758
Substrate/Competitorn/a
Meas. Tech.ChEMBL_1499376 (CHEMBL3583705)
EC50 138±n/a nM
Citation Chiellini, GNesi, GDigiacomo, MMalvasi, REspinoza, SSabatini, MFrascarelli, SLaurino, ACichero, EMacchia, MGainetdinov, RRFossa, PRaimondi, LZucchi, RRapposelli, S Design, Synthesis, and Evaluation of Thyronamine Analogues as Novel Potent Mouse Trace Amine Associated Receptor 1 (mTAAR1) Agonists. J Med Chem58:5096-107 (2015) 
 
Trace amine-associated receptor 1
Name:Trace amine-associated receptor 1
Type:Protein
Mol. Mass.:37635.41
Organism:Mus musculus (Mouse)
Description:Q923Y8
Residue:332
BDBM10758
NameBDBM10758
Synonyms:14C-phenylethylamine CHEMBL610 | phenylethylamine
TypeSmall organic molecule
Emp. Form.C8H11N
Mol. Mass.121.1796
SMILESNCCc1ccccc1