Reaction Details
TargetAurora kinase B
LigandBDBM50097414
Substrate/Competitorn/a
Meas. Tech.ChEMBL_1502091 (CHEMBL3586966)
IC50>10000±n/a nM
Citation Sells, TBChau, REcsedy, JAGershman, REHoar, KHuck, JJanowick, DAKadambi, VJLeRoy, PJStirling, MStroud, SGVos, TJWeatherhead, GSWysong, DRZhang, MBalani, SKBolen, JBManfredi, MGClaiborne, CF MLN8054 and Alisertib (MLN8237): Discovery of Selective Oral Aurora A Inhibitors. ACS Med Chem Lett6:630-4 (2015) 
 
Aurora kinase B
Name:Aurora kinase B
Type:Protein
Mol. Mass.:39327.72
Organism:Homo sapiens (Human)
Description:Q96GD4
Residue:344
BDBM50097414
NameBDBM50097414
Synonyms:CHEMBL3586468
TypeSmall organic molecule
Emp. Form.C25H16ClFN4O2
Mol. Mass.458.872
SMILESOC(=O)c1ccc(Nc2ncc3CN=C(c4ccccc4F)c4cc(Cl)ccc4-c3n2)cc1