Reaction Details
TargetAurora kinase A
LigandBDBM31093
Substrate/Competitorn/a
Meas. Tech.ChEMBL_1502089 (CHEMBL3586964)
IC50 31±n/a nM
Citation Sells, TBChau, REcsedy, JAGershman, REHoar, KHuck, JJanowick, DAKadambi, VJLeRoy, PJStirling, MStroud, SGVos, TJWeatherhead, GSWysong, DRZhang, MBalani, SKBolen, JBManfredi, MGClaiborne, CF MLN8054 and Alisertib (MLN8237): Discovery of Selective Oral Aurora A Inhibitors. ACS Med Chem Lett6:630-4 (2015) 
 
Aurora kinase A
Name:Aurora kinase A
Type:Enzyme
Mol. Mass.:44791.66
Organism:Mus musculus (mouse)
Description:n/a
Residue:395
BDBM31093
NameBDBM31093
Synonyms:4-[[7-[2,6-bis(fluoranyl)phenyl]-9-chloranyl-5H-pyrimido[5,4-d][2]benzazepin-2-yl]amino]benzoic acid BDBM31832 MLN-8054 | cid_11712649
TypeSmall organic molecule
Emp. Form.C25H15ClF2N4O2
Mol. Mass.476.862
SMILESOC(=O)c1ccc(Nc2ncc3CN=C(c4cc(Cl)ccc4-c3n2)c2c(F)cccc2F)cc1