Reaction Details
TargetKappa-type opioid receptor
LigandBDBM54817
Substrate/Competitorn/a
Meas. Tech.ChEMBL_1504511 (CHEMBL3590953)
IC50 138±n/a nM
Citation Frankowski, KJSlauson, SRLovell, KMPhillips, AMStreicher, JMZhou, LWhipple, DASchoenen, FJPrisinzano, TEBohn, LMAubé, J Potency enhancement of the¿-opioid receptor antagonist probe ML140 through sulfonamide constraint utilizing a tetrahydroisoquinoline motif. Bioorg Med Chem23:3948-56 (2015) 
 
Kappa-type opioid receptor
Name:Kappa-type opioid receptor
Type:G Protein-Coupled Receptor (GPCR)
Mol. Mass.:42648.76
Organism:Homo sapiens (Human)
Description:P41145
Residue:380
BDBM54817
NameBDBM54817
Synonyms:4-[[(4-methylphenyl)sulfonylamino]methyl]-N-[2-[(phenylmethyl)-propan-2-yl-amino]ethyl]benzamide MLS000682490 N-[2-[benzyl(propan-2-yl)amino]ethyl]-4-[[(4-methylphenyl)sulfonylamino]methyl]benzamide SMR000314971 | cid_3342390
TypeSmall organic molecule
Emp. Form.C27H33N3O3S
Mol. Mass.479.634
SMILESCC(C)N(CCNC(=O)c1ccc(CNS(=O)(=O)c2ccc(C)cc2)cc1)Cc1ccccc1