Reaction Details
TargetKappa-type opioid receptor
LigandBDBM50097706
Substrate/Competitorn/a
Meas. Tech.ChEMBL_1504511 (CHEMBL3590953)
IC50>18000±n/a nM
Citation Frankowski, KJSlauson, SRLovell, KMPhillips, AMStreicher, JMZhou, LWhipple, DASchoenen, FJPrisinzano, TEBohn, LMAubé, J Potency enhancement of the¿-opioid receptor antagonist probe ML140 through sulfonamide constraint utilizing a tetrahydroisoquinoline motif. Bioorg Med Chem23:3948-56 (2015) 
 
Kappa-type opioid receptor
Name:Kappa-type opioid receptor
Type:G Protein-Coupled Receptor (GPCR)
Mol. Mass.:42648.76
Organism:Homo sapiens (Human)
Description:P41145
Residue:380
BDBM50097706
NameBDBM50097706
Synonyms:CHEMBL3590202
TypeSmall organic molecule
Emp. Form.C28H33N3O3S
Mol. Mass.491.645
SMILESCc1ccc(cc1)S(=O)(=O)NCc1ccc(cc1)C(=O)NCC1CCCN(Cc2ccccc2)C1