Reaction Details
TargetDelta-type opioid receptor
LigandBDBM50097699
Substrate/Competitorn/a
Meas. Tech.ChEMBL_1504517 (CHEMBL3590959)
Ki 2328±n/a nM
Citation Frankowski, KJSlauson, SRLovell, KMPhillips, AMStreicher, JMZhou, LWhipple, DASchoenen, FJPrisinzano, TEBohn, LMAubé, J Potency enhancement of the¿-opioid receptor antagonist probe ML140 through sulfonamide constraint utilizing a tetrahydroisoquinoline motif. Bioorg Med Chem23:3948-56 (2015) 
 
Delta-type opioid receptor
Name:Delta-type opioid receptor
Type:G Protein-Coupled Receptor (GPCR)
Mol. Mass.:40382.98
Organism:Homo sapiens (Human)
Description:Competition binding assays were carried out using membrane preparations from transfected HN9.10 cells that constitutively expressed the delta opioid receptor.
Residue:372
BDBM50097699
NameBDBM50097699
Synonyms:CHEMBL3590195
TypeSmall organic molecule
Emp. Form.C30H37N3O3S
Mol. Mass.519.698
SMILESCc1ccc(cc1)S(=O)(=O)N1CCc2cc(ccc2C1)C(=O)NCCN(Cc1ccccc1)C(C)(C)C