Reaction Details
TargetHeat shock protein HSP 90-alpha/90-beta
LigandBDBM50097907
Substrate/Competitorn/a
Meas. Tech.ChEMBL_1502283 (CHEMBL3591362)
Ki 3.3±n/a nM
Citation Smith, DABeaumont, KMaurer, TSDi, L Volume of Distribution in Drug Design. J Med Chem58:5691-8 (2015) 
 
Heat shock protein HSP 90-alpha/90-beta
Name:Heat shock protein HSP 90-alpha/90-beta
Type:n/a
Mol. Mass.:n/a
Description:ASSAY_ID of EBI is 29664
Components:This complex has 2 components.
Component 1
Name:Heat shock protein HSP 90-alpha
Synonyms:HS90A_HUMAN HSP86 HSP90AA1 HSPCA Heat shock 86 kDa Heat shock protein HSP 90-alpha (HSP90) LAP-2 Lipopolysaccharide-associated protein 2 heat shock protein 90kDa alpha (cytosolic), class A member 1 isoform 2
Type:Molecular Chaperone
Mol. Mass.:84623.45
Organism:Homo sapiens (Human)
Description:P07900
Residue:732
Component 2
Name:Heat shock protein HSP 90-beta
Synonyms:HS90B_HUMAN HSP 90 HSP90B HSPCB Heat shock protein HSP 90 (Hsp90)
Type:Molecular Chaperone
Mol. Mass.:83229.45
Organism:Homo sapiens (Human)
Description:P08238
Residue:724
BDBM50097907
NameBDBM50097907
Synonyms:CHEMBL3589962
TypeSmall organic molecule
Emp. Form.C26H28Cl2FN7O2
Mol. Mass.560.451
SMILESCC(C)(NC(=O)N1Cc2nc(N)nc(c2C1)-c1c(Cl)cc(Cl)cc1OCCn1cc(F)cn1)C12CC(C1)C2