Reaction Details
TargetATPase family AAA domain-containing protein 2
LigandBDBM50098255
Substrate/Competitorn/a
Meas. Tech.ChEMBL_1502811 (CHEMBL3591371)
IC50 100±n/a nM
Citation Bamborough, PChung, CWFurze, RCGrandi, PMichon, AMSheppard, RJBarnett, HDiallo, HDixon, DPDouault, CJones, EJKaramshi, BMitchell, DJPrinjha, RKRau, CWatson, RJWerner, TDemont, EH Structure-Based Optimization of Naphthyridones into Potent ATAD2 Bromodomain Inhibitors. J Med Chem58:6151-78 (2015) 
 
ATPase family AAA domain-containing protein 2
Name:ATPase family AAA domain-containing protein 2
Type:PROTEIN
Mol. Mass.:158546.30
Organism:Homo sapiens (Human)
Description:ChEMBL_1500426
Residue:1390
BDBM50098255
NameBDBM50098255
Synonyms:CHEMBL3590381
TypeSmall organic molecule
Emp. Form.C25H31N5O4S
Mol. Mass.497.61
SMILESCc1cc2c(cnc(N[C@@H]3CCNC[C@H]3OCC3CCS(=O)(=O)CC3)c2[nH]c1=O)-c1cccnc1