Reaction Details
TargetBromodomain-containing protein 4
LigandBDBM50098315
Substrate/Competitorn/a
Meas. Tech.ChEMBL_1502808 (CHEMBL3591211)
IC50 6310±n/a nM
Citation Bamborough, PChung, CWFurze, RCGrandi, PMichon, AMSheppard, RJBarnett, HDiallo, HDixon, DPDouault, CJones, EJKaramshi, BMitchell, DJPrinjha, RKRau, CWatson, RJWerner, TDemont, EH Structure-Based Optimization of Naphthyridones into Potent ATAD2 Bromodomain Inhibitors. J Med Chem58:6151-78 (2015) 
 
Bromodomain-containing protein 4
Name:Bromodomain-containing protein 4
Type:Protein
Mol. Mass.:152264.84
Organism:Homo sapiens (Human)
Description:O60885
Residue:1362
BDBM50098315
NameBDBM50098315
Synonyms:CHEMBL3590402
TypeSmall organic molecule
Emp. Form.C18H26N4O2
Mol. Mass.330.4246
SMILESCC(C)CO[C@@H]1CNCC[C@H]1Nc1nccc2cc(C)c(=O)[nH]c12