Reaction Details
TargetATPase family AAA domain-containing protein 2
LigandBDBM50098249
Substrate/Competitorn/a
Meas. Tech.ChEMBL_1502813 (CHEMBL3591373)
Kd 2900±n/a nM
Citation Bamborough, PChung, CWFurze, RCGrandi, PMichon, AMSheppard, RJBarnett, HDiallo, HDixon, DPDouault, CJones, EJKaramshi, BMitchell, DJPrinjha, RKRau, CWatson, RJWerner, TDemont, EH Structure-Based Optimization of Naphthyridones into Potent ATAD2 Bromodomain Inhibitors. J Med Chem58:6151-78 (2015) 
 
ATPase family AAA domain-containing protein 2
Name:ATPase family AAA domain-containing protein 2
Type:PROTEIN
Mol. Mass.:158546.30
Organism:Homo sapiens (Human)
Description:ChEMBL_1500426
Residue:1390
BDBM50098249
NameBDBM50098249
Synonyms:CHEMBL3590388
TypeSmall organic molecule
Emp. Form.C21H30N4O2
Mol. Mass.370.4885
SMILESCc1cc2ccnc(N[C@@H]3CCNC[C@H]3OCC3CCCCC3)c2[nH]c1=O