Reaction Details
TargetATPase family AAA domain-containing protein 2
LigandBDBM50098252
Substrate/Competitorn/a
Meas. Tech.ChEMBL_1502813 (CHEMBL3591373)
Kd 3200±n/a nM
Citation Bamborough, PChung, CWFurze, RCGrandi, PMichon, AMSheppard, RJBarnett, HDiallo, HDixon, DPDouault, CJones, EJKaramshi, BMitchell, DJPrinjha, RKRau, CWatson, RJWerner, TDemont, EH Structure-Based Optimization of Naphthyridones into Potent ATAD2 Bromodomain Inhibitors. J Med Chem58:6151-78 (2015) 
 
ATPase family AAA domain-containing protein 2
Name:ATPase family AAA domain-containing protein 2
Type:PROTEIN
Mol. Mass.:158546.30
Organism:Homo sapiens (Human)
Description:ChEMBL_1500426
Residue:1390
BDBM50098252
NameBDBM50098252
Synonyms:CHEMBL3590394
TypeSmall organic molecule
Emp. Form.C20H28N4O3
Mol. Mass.372.4613
SMILESCc1cc2ccnc(N[C@@H]3CCNC[C@H]3OCC3CCOCC3)c2[nH]c1=O