Reaction Details
TargetBromodomain adjacent to zinc finger domain protein 2B
LigandBDBM50098305
Substrate/Competitorn/a
Meas. Tech.ChEMBL_1502827 (CHEMBL3591387)
Kd 7943±n/a nM
Citation Bamborough, PChung, CWFurze, RCGrandi, PMichon, AMSheppard, RJBarnett, HDiallo, HDixon, DPDouault, CJones, EJKaramshi, BMitchell, DJPrinjha, RKRau, CWatson, RJWerner, TDemont, EH Structure-Based Optimization of Naphthyridones into Potent ATAD2 Bromodomain Inhibitors. J Med Chem58:6151-78 (2015) 
 
Bromodomain adjacent to zinc finger domain protein 2B
Name:Bromodomain adjacent to zinc finger domain protein 2B
Type:PROTEIN
Mol. Mass.:240455.43
Organism:Homo sapiens (Human)
Description:ChEMBL_1498197
Residue:2168
BDBM50098305
NameBDBM50098305
Synonyms:CHEMBL3590405
TypeSmall organic molecule
Emp. Form.C27H34N4O4S
Mol. Mass.510.648
SMILESCc1cncc(c1)-c1ccc(N[C@@H]2CCNC[C@H]2OCC2CCS(=O)(=O)CC2)c2[nH]c(=O)c(C)cc12