Reaction Details
TargetBromodomain-containing protein 4
LigandBDBM50098305
Substrate/Competitorn/a
Meas. Tech.ChEMBL_1502831 (CHEMBL3591391)
Kd 1259±n/a nM
Citation Bamborough, PChung, CWFurze, RCGrandi, PMichon, AMSheppard, RJBarnett, HDiallo, HDixon, DPDouault, CJones, EJKaramshi, BMitchell, DJPrinjha, RKRau, CWatson, RJWerner, TDemont, EH Structure-Based Optimization of Naphthyridones into Potent ATAD2 Bromodomain Inhibitors. J Med Chem58:6151-78 (2015) 
 
Bromodomain-containing protein 4
Name:Bromodomain-containing protein 4
Type:Protein
Mol. Mass.:152264.84
Organism:Homo sapiens (Human)
Description:O60885
Residue:1362
BDBM50098305
NameBDBM50098305
Synonyms:CHEMBL3590405
TypeSmall organic molecule
Emp. Form.C27H34N4O4S
Mol. Mass.510.648
SMILESCc1cncc(c1)-c1ccc(N[C@@H]2CCNC[C@H]2OCC2CCS(=O)(=O)CC2)c2[nH]c(=O)c(C)cc12