Reaction Details
TargetHistone acetyltransferase KAT2A
LigandBDBM50098250
Substrate/Competitorn/a
Meas. Tech.ChEMBL_1502837 (CHEMBL3591397)
Kd<100000±n/a nM
Citation Bamborough, PChung, CWFurze, RCGrandi, PMichon, AMSheppard, RJBarnett, HDiallo, HDixon, DPDouault, CJones, EJKaramshi, BMitchell, DJPrinjha, RKRau, CWatson, RJWerner, TDemont, EH Structure-Based Optimization of Naphthyridones into Potent ATAD2 Bromodomain Inhibitors. J Med Chem58:6151-78 (2015) 
 
Histone acetyltransferase KAT2A
Name:Histone acetyltransferase KAT2A
Type:PROTEIN
Mol. Mass.:93956.22
Organism:Homo sapiens (Human)
Description:ChEMBL_100876
Residue:837
BDBM50098250
NameBDBM50098250
Synonyms:CHEMBL3590389
TypeSmall organic molecule
Emp. Form.C27H35N5O2
Mol. Mass.461.5991
SMILESCc1cncc(c1)-c1cnc(N[C@@H]2CCNC[C@H]2OCC2CCCCC2)c2[nH]c(=O)c(C)cc12