Reaction Details
TargetBromodomain testis-specific protein
LigandBDBM50098311
Substrate/Competitorn/a
Meas. Tech.ChEMBL_1502845 (CHEMBL3591405)
IC50<50119±n/a nM
Citation Bamborough, PChung, CWFurze, RCGrandi, PMichon, AMSheppard, RJBarnett, HDiallo, HDixon, DPDouault, CJones, EJKaramshi, BMitchell, DJPrinjha, RKRau, CWatson, RJWerner, TDemont, EH Structure-Based Optimization of Naphthyridones into Potent ATAD2 Bromodomain Inhibitors. J Med Chem58:6151-78 (2015) 
 
Bromodomain testis-specific protein
Name:Bromodomain testis-specific protein
Type:PROTEIN
Mol. Mass.:107982.01
Organism:Homo sapiens (Human)
Description:ChEMBL_1502985
Residue:947
BDBM50098311
NameBDBM50098311
Synonyms:CHEMBL3590408
TypeSmall organic molecule
Emp. Form.C27H35N5O4S
Mol. Mass.525.663
SMILESCN1CC[C@@H](Nc2ncc(-c3cncc(C)c3)c3cc(C)c(=O)[nH]c23)[C@@H](C1)OCC1CCS(=O)(=O)CC1