Reaction Details
TargetATPase family AAA domain-containing protein 2
LigandBDBM50098301
Substrate/Competitorn/a
Meas. Tech.ChEMBL_1502846 (CHEMBL3591406)
IC50 126±n/a nM
Citation Bamborough, PChung, CWFurze, RCGrandi, PMichon, AMSheppard, RJBarnett, HDiallo, HDixon, DPDouault, CJones, EJKaramshi, BMitchell, DJPrinjha, RKRau, CWatson, RJWerner, TDemont, EH Structure-Based Optimization of Naphthyridones into Potent ATAD2 Bromodomain Inhibitors. J Med Chem58:6151-78 (2015) 
 
ATPase family AAA domain-containing protein 2
Name:ATPase family AAA domain-containing protein 2
Type:PROTEIN
Mol. Mass.:158546.30
Organism:Homo sapiens (Human)
Description:ChEMBL_1500426
Residue:1390
BDBM50098301
NameBDBM50098301
Synonyms:CHEMBL3590383
TypeSmall organic molecule
Emp. Form.C26H33N5O4S
Mol. Mass.511.636
SMILESCc1cncc(c1)-c1cnc(N[C@@H]2CCNC[C@H]2OCC2CCS(=O)(=O)CC2)c2[nH]c(=O)c(C)cc12