Reaction Details
TargetBromodomain-containing protein 4
LigandBDBM50098255
Substrate/Competitorn/a
Meas. Tech.ChEMBL_1502808 (CHEMBL3591211)
IC50 10000±n/a nM
Citation Bamborough, PChung, CWFurze, RCGrandi, PMichon, AMSheppard, RJBarnett, HDiallo, HDixon, DPDouault, CJones, EJKaramshi, BMitchell, DJPrinjha, RKRau, CWatson, RJWerner, TDemont, EH Structure-Based Optimization of Naphthyridones into Potent ATAD2 Bromodomain Inhibitors. J Med Chem58:6151-78 (2015) 
 
Bromodomain-containing protein 4
Name:Bromodomain-containing protein 4
Type:Protein
Mol. Mass.:152264.84
Organism:Homo sapiens (Human)
Description:O60885
Residue:1362
BDBM50098255
NameBDBM50098255
Synonyms:CHEMBL3590381
TypeSmall organic molecule
Emp. Form.C25H31N5O4S
Mol. Mass.497.61
SMILESCc1cc2c(cnc(N[C@@H]3CCNC[C@H]3OCC3CCS(=O)(=O)CC3)c2[nH]c1=O)-c1cccnc1