Reaction Details
TargetBromodomain-containing protein 4
LigandBDBM50098302
Substrate/Competitorn/a
Meas. Tech.ChEMBL_1502808 (CHEMBL3591211)
IC50 7943±n/a nM
Citation Bamborough, PChung, CWFurze, RCGrandi, PMichon, AMSheppard, RJBarnett, HDiallo, HDixon, DPDouault, CJones, EJKaramshi, BMitchell, DJPrinjha, RKRau, CWatson, RJWerner, TDemont, EH Structure-Based Optimization of Naphthyridones into Potent ATAD2 Bromodomain Inhibitors. J Med Chem58:6151-78 (2015) 
 
Bromodomain-containing protein 4
Name:Bromodomain-containing protein 4
Type:Protein
Mol. Mass.:152264.84
Organism:Homo sapiens (Human)
Description:O60885
Residue:1362
BDBM50098302
NameBDBM50098302
Synonyms:CHEMBL3590384
TypeSmall organic molecule
Emp. Form.C26H33N5O4
Mol. Mass.479.5713
SMILESCOc1cncc(c1)-c1cnc(N[C@@H]2CCNC[C@H]2OCC2CCOCC2)c2[nH]c(=O)c(C)cc12