Reaction Details
TargetKallikrein-1
LigandBDBM50098591
Substrate/Competitorn/a
Meas. Tech.ChEMBL_1504789 (CHEMBL3595074)
Ki 18±n/a nM
Citation Priestley, ESCheney, DLDeLucca, IWei, ALuettgen, JMRendina, ARWong, PCWexler, RR Structure-Based Design of Macrocyclic Coagulation Factor VIIa Inhibitors. J Med Chem58:6225-36 (2015) 
 
Kallikrein-1
Name:Kallikrein-1
Type:Enzyme
Mol. Mass.:28874.69
Organism:Homo sapiens (Human)
Description:P06870
Residue:262
BDBM50098591
NameBDBM50098591
Synonyms:CHEMBL3594305
TypeSmall organic molecule
Emp. Form.C28H27N5O2
Mol. Mass.465.5463
SMILESNc1nccc2cc(N[C@@H]3c4ccc(CCCC(=O)Nc5cccc(CNC3=O)c5)cc4)ccc12