Reaction Details
TargetPlasma kallikrein
LigandBDBM50098598
Substrate/Competitorn/a
Meas. Tech.ChEMBL_1504788 (CHEMBL3595073)
Ki 3600±n/a nM
Citation Priestley, ESCheney, DLDeLucca, IWei, ALuettgen, JMRendina, ARWong, PCWexler, RR Structure-Based Design of Macrocyclic Coagulation Factor VIIa Inhibitors. J Med Chem58:6225-36 (2015) 
 
Plasma kallikrein
Name:Plasma kallikrein
Type:Protein
Mol. Mass.:71391.16
Organism:Homo sapiens (Human)
Description:P03952
Residue:638
BDBM50098598
NameBDBM50098598
Synonyms:CHEMBL3594311
TypeSmall organic molecule
Emp. Form.C31H33N5O4S
Mol. Mass.571.69
SMILESCC(C)S(=O)(=O)c1ccc2NC(=O)CCCc3ccc(cc3)[C@@H](Nc3ccc4c(N)nccc4c3)C(=O)NCc1c2