Reaction Details
TargetRap guanine nucleotide exchange factor 4
LigandBDBM50098709
Substrate/Competitorn/a
Meas. Tech.ChEMBL_1504797 (CHEMBL3595150)
IC50 2700±n/a nM
Citation Ye, NZhu, YChen, HLiu, ZMei, FCWild, CChen, HCheng, XZhou, J Structure-Activity Relationship Studies of Substituted 2-(Isoxazol-3-yl)-2-oxo-N'-phenyl-acetohydrazonoyl Cyanide Analogues: Identification of Potent Exchange Proteins Directly Activated by cAMP (EPAC) Antagonists. J Med Chem58:6033-47 (2015) 
 
Rap guanine nucleotide exchange factor 4
Name:Rap guanine nucleotide exchange factor 4
Type:PROTEIN
Mol. Mass.:115497.71
Organism:Mus musculus
Description:ChEMBL_109832
Residue:1011
BDBM50098709
NameBDBM50098709
Synonyms:CHEMBL3593338
TypeSmall organic molecule
Emp. Form.C16H14ClFN4O2
Mol. Mass.348.759
SMILESCC(C)(C)c1cc(no1)C(=O)C(=N\Nc1ccc(F)c(Cl)c1)\C#N