Reaction Details
TargetRap guanine nucleotide exchange factor 4
LigandBDBM50098797
Substrate/Competitorn/a
Meas. Tech.ChEMBL_1504797 (CHEMBL3595150)
IC50 3500±n/a nM
Citation Ye, NZhu, YChen, HLiu, ZMei, FCWild, CChen, HCheng, XZhou, J Structure-Activity Relationship Studies of Substituted 2-(Isoxazol-3-yl)-2-oxo-N'-phenyl-acetohydrazonoyl Cyanide Analogues: Identification of Potent Exchange Proteins Directly Activated by cAMP (EPAC) Antagonists. J Med Chem58:6033-47 (2015) 
 
Rap guanine nucleotide exchange factor 4
Name:Rap guanine nucleotide exchange factor 4
Type:PROTEIN
Mol. Mass.:115497.71
Organism:Mus musculus
Description:ChEMBL_109832
Residue:1011
BDBM50098797
NameBDBM50098797
Synonyms:CHEMBL3593471
TypeSmall organic molecule
Emp. Form.C18H15Cl3N4O2
Mol. Mass.425.696
SMILESClc1cc(N\N=C(/C#N)C(=O)c2cc(on2)C2CCCCC2)cc(Cl)c1Cl