Reaction Details
TargetBifunctional epoxide hydrolase 2
LigandBDBM50327809
Substrate/Competitorn/a
Meas. Tech.ChEMBL_1456719 (CHEMBL3371009)
IC50 29±n/a nM
Citation Lee, KSLiu, JYWagner, KMPakhomova, SDong, HMorisseau, CFu, SHYang, JWang, PUlu, AMate, CANguyen, LVHwang, SHEdin, MLMara, AAWulff, HNewcomer, MEZeldin, DCHammock, BD Optimized inhibitors of soluble epoxide hydrolase improve in vitro target residence time and in vivo efficacy. J Med Chem57:7016-30 (2014) 
 
Bifunctional epoxide hydrolase 2
Name:Bifunctional epoxide hydrolase 2
Type:PROTEIN
Mol. Mass.:62337.15
Organism:Rattus norvegicus
Description:ChEMBL_1465995
Residue:554
BDBM50327809
NameBDBM50327809
Synonyms:1-(1-Propionylpiperidin-4-yl)-3-(4-(trifluoromethoxy)phenyl)urea US10383835, Compound 1770 US9296693, 40
TypeSmall organic molecule
Emp. Form.C16H20F3N3O3
Mol. Mass.359.3435
SMILESCCC(=O)N1CCC(CC1)NC(=O)Nc1ccc(OC(F)(F)F)cc1