Reaction Details
TargetBifunctional epoxide hydrolase 2
LigandBDBM50100520
Substrate/Competitorn/a
Meas. Tech.ChEMBL_1456719 (CHEMBL3371009)
IC50 13±n/a nM
Citation Lee, KSLiu, JYWagner, KMPakhomova, SDong, HMorisseau, CFu, SHYang, JWang, PUlu, AMate, CANguyen, LVHwang, SHEdin, MLMara, AAWulff, HNewcomer, MEZeldin, DCHammock, BD Optimized inhibitors of soluble epoxide hydrolase improve in vitro target residence time and in vivo efficacy. J Med Chem57:7016-30 (2014) 
 
Bifunctional epoxide hydrolase 2
Name:Bifunctional epoxide hydrolase 2
Type:PROTEIN
Mol. Mass.:62337.15
Organism:Rattus norvegicus
Description:ChEMBL_1465995
Residue:554
BDBM50100520
NameBDBM50100520
Synonyms:CHEMBL3327077 US11123311, Compound 2422
TypeSmall organic molecule
Emp. Form.C17H22F3N3O3
Mol. Mass.373.3701
SMILESCC(C)C(=O)N1CCC(CC1)NC(=O)Nc1ccc(OC(F)(F)F)cc1